{"text_format":"1","workbook":"xlsx","n_sheets":10,"sheets":["Aggregate Gradations","MixDesign","Advanced","Program v.3","Aggregates","Aggregates (Max-Min)","AEA","Admixtures","Cement","Calculations"],"not_rendered":{"charts":16,"images":47,"macros":1,"external_links":0,"defined_names":4906,"comments":0,"pivot_tables":0},"unopened":[],"bounds":{"document_bytes":16777216,"sheet_cells":100000,"rows_first":2000,"rows_last":500,"rows_between":2000,"halvings":0,"cell_chars":16384,"cell_head_chars":4096},"cells_cut":0,"cells_raw":0,"read":"whole","date_system":"1900"}

{"sheet":"Aggregate Gradations","index":0,"n_rows":112,"n_cols":90,"rows_kept":112,"cut":false,"hidden":true,"merged":[]}
[]
["Aggregate Type",null,"KDOT Kansas River Sand","KDOT Limestone","Midwest Concrete Sand","Midwest SA-1","Granite","LRM - Arch (from Midwest)","LRM - Pea G.","Midwest 3/4 x 3/8","Stone 1","Stone 2","Stone 3","Sand 1","Sand 2","KDOT Kansas River Sand 6/17/03","LRM Pea Gravel 6/17/03","1\" Washed Airport Limestone 10/2003","1 1/4\" Quartzite 10/2003","Quartzite Chip 10/2003","KDOT Kansas River Sand 12/12/03","? Saif 9/2/03","KDOT Kansas River 2-18-04","Pea Gravel 2-18-04","3/4\" KDOT Limestone 2-18-04","3/4\" KDOT Limestone 4/29/2004","1\" Washed Airport Limestone sieved","cement sand","3/4\" KDOT Limestone 6/18/2004","KDOT Kansas River Sand 6/18/04","Pea Gravel 6/18/04","#67 Quartzite 6/23/2004","Quartzite 1 1/4\" 6/24/2004","#67 Quartzite 6/28/2004","Kansas 3/4in. Granite 8/3/04","#57 Limestone HMM 9/7/2004","Martin Marietta Limestone 9/14/2004","#57 Granite 9/14/2004","#67 Quartzite 10/8/2004","3/4\" KDOT Limestone 10/8/2004","KDOT Sand 10/8/2004","ACI 211.1 Apx 1 Example CA","ACI 211.1 Apx 1 Example FA","ACI 211.1 Apx 1 Example Blending","Swapnil's next aggregate","3/4\" KDOT Limestone 01/10/2005","3/4\" Quartzite 01/10/2005","3/4\" Granite 01/10/2005","KDOT Sand 01/10/2005","LRM Pea Gravel 01/10/2005","A1 - Granite","A2 - River Sand","A3 - Pea Gravel","A4 - Small Deco","OK - CA #1","OK - IA #1","OK - FA","OK - IA #2","3/4\" Quartzite 03/19/05","3/4\" KDOT Limestone 03/19/05","OK - CA #2","GMQ 1.5 PCCP","GMQ CA7","GMQ 3MA (3/8\")","GMQ 3/4\"","MA-2 Holliday","KC 3/4\"","LRM Kansas River Sand 5-5-05","LRM 3/4\" Class 1 Limestone","LRM Kansas River Sand 6-6-05","LRM 3/4\" Class 1 Limestone 6-3-05","LRM Pea Gravel 6-14-05","LRM Kansas River Sand 6-23-05","LRM 3/4\" Class 1 Limestone","LRM 3/4\" Class 1 Limestone 7/14/05","LRM Pea Gravel 7/14/05","LRM 3/4\" Limestone >3/8\"","LRM 3/4\" Limestone <3/8\""]
["Data #",null,1,2,3,4,5,6,7,8,9,10,11,12,13,14,15,16,17,18,19,20,21,22,23,24,25,26,27,28,29,30,31,32,33,34,35,36,37,38,39,40,41,42,43,44,45,46,47,48,49,50,51,52,53,54,55,56,57,58,59,60,61,62,63,64,65,66,67,68,69,70,71,72,73,74,75,76]
[]
["Specific Gravity",null,2.63,2.58,null,null,2.63,null,null,null,null,null,null,null,null,null,null,2.57,2.63,2.63,null,null,2.63,2.62,"?",null,null,null,null,null,null,null,null,null,null,null,null,null,null,null,null,null,null,null,5.2,2.5299999999999998,2.63,2.58,2.63,2.62]
["% Absorption",null,0.3,3,null,null,0.7,null,0.7,null,null,null,null,null,null,null,null,3.92,0.44,0.49,null,null,0.35,0.6,"?",null,null,null,null,null,null,null,null,null,null,null,null,null,null,null,null,null,null,null,0.01,2.85,0.5,0.7,0.35,0.6]
["% Fines",null,null,null,null,null,null,null,null,null,null,null,null,null,null,null,null,1.27,0.6,0.6,null,null,1.46,0.55000000000000004,null,null,null,null,null,null,null,null,null,null,null,null,null,null,null,null,null,null,null,null,0,null,null,null,1.46,0.55000000000000004]
["Cumulative Percent Retained"]
["1 1/2\"",null,0,0,0,0,0,0,0,0,0,6.5,0,0,0,0,0,0,0,0,0,0,0,0,0,0,0,0,0,0,0,0,0,0,0,0,0,0,0,0,0,0,0,0,0,0,0,0,0,0,0,0,0,0,0,0,0,0,0,0,0,0,0,0,0,0,0,0,0,0,0,0,0,0,0,0,0,0]
["1\"",null,0,0,0,0,0,0,0,0,0,40,0,0,0,0,0,0,0,0,0,0,0,0,0,0,0,0,0.06,0,0,0,0,0,0,0,0,0.4,0,0,0,0,0,0,50,0,0,0,0,0,4,0,0,0,0,0,0,0,0,0,1.0999999999999943,14.1,0,0,0,0,0,0,0,0,0,0,0,0,0,0,0,0]
["3/4\"",null,0,0,0,0,0,0,0,0,3.5,67,0,0,0,0,0,25.94,8.31,0,0,0,0,0,0,0,0,0,0.19,0,0,0.6361323155216374,4.3391188251001456,1.58,2.005174644243223,2.7,0,17.899999999999999,1.4,0,0,20.909627879503841,0,0,80,0,2,1.3,0,0,15,0,0,0,0.79999999999999716,0,0,0,0.2,0,14.8,43.5,0,0,{"$f":"100-95","v":5},0,4,0,0,0,0,0,0,0,0.06,0,0.12345679012345678,0]
["1/2\"",null,0,27.9,0,0,38.4,7.9,0,23,39.9,84,28,0,0,0,0,97.66,55.24,0.27,0,13.99,0,0,23.04,19,96.945701357466049,0,11.47,0,0,22.201017811704844,48.531375166889184,27.44,20.181112548512292,30.5,18.440000000000001,53.84,29.7,17.5,0,65.682220909627887,0,0,90,18.899999999999999,33.1,21.7,0,0,{"$f":"40.2+AY11","v":55.2},0,0,7.9,26.4,0,0,0,10.1,22.6,70.7,73.900000000000006,6.5,0,{"$f":"100-56","v":44},0,40,0,17.13,0,25.3,0,0,25,21.8,0,44.855967078189302,0]
["3/8\"",null,0,56.1,0,0,66.599999999999994,39.700000000000003,0,54,65.8,93,47,0,5,0,0,99.12,78.239999999999995,17.77,0,37.01,0,0,49.5,45.7,98.925339366515828,0,30.13,0,0,57.061068702290079,75.300400534045394,55.84,50.970245795601571,56.1,41.94,75.239999999999995,65.8,43.3,0,88.068517424689901,0,16.399999999999999,95,44.4,67.5,51.7,0,0,{"$f":"AY12+23","v":78.2},0,0,{"$f":"31.8+BB12","v":39.700000000000003},68.900000000000006,1.9000000000000057,0,0,32.700000000000003,48.7,86.3,84.1,44.5,5,{"$f":"100-23","v":77},0,{"$f":"100-28","v":72},0,42.34,0,55.1,0,0,54.5,45.9,0,94.444444444444443,0]
["#4",null,1.2,94,5,21,96.8,92.4,10.9,98,93.3,97,85,0,13,0.6,11.8,99.29,95.8,93.77,1.2,87.74,1.4,10.3,91.6,89.6,99.151583710407238,0,78.849999999999994,1.6,12.47,95.419847328244288,97.797062750333779,92.63,95.342820181112558,92.2,86.61,96.37,98.1,88.9,1.4,100,1.0479041916167664,45.6,96,90.8,98.9,97.2,2,9.6,{"$f":"AY13+17.6","v":95.800000000000011},2,9.6,{"$f":"52.7+BB13","v":92.4},97.1,89.4,4,53.8,93.5,90.4,99,98.2,96.7,95.37,{"$f":"100-2","v":98},0,98,0,88.3,1.3,93.3,10.1,0.9,89.7,86.9,9.5,94.444444444444443,80.234833659491201,null,null,null,null,null,null,null,null,"sum",900,{"$f":"CJ14/SUM($CJ$14:$CJ$17)","v":0.30272452068617556},30]
["#8",null,12.4,98,22,65,99.1,97.6,48.1,99,99,98,93,6,45,10.4,52.8,99.33,98.05,99.31,13.8,96.49,14.5,51.3,97.74,97.3,99.208144796380083,0,93.91,14.32,52.98,97.32824427480918,99.265687583444603,96.09,97.02457956015526,97.3,97.81,97.72,99.7,97.2,14.2,100,12.425149700598801,71.3,97,98.5,99.7,98.9,13.8,43.2,{"$f":"AY14+2.3","v":98.100000000000009},13.8,{"$f":"33.6+BA14","v":43.2},{"$f":"5.2+BB14","v":97.600000000000009},98.4,98.4,12,93.6,99.2,97.8,99.2,100,98.5,97.36,{"$f":"100-1","v":99},16,99,16.399999999999999,96.54,11.7,97.3,56.7,10.9,95.3,94.3,50.4,94.444444444444443,94.716242661448135,null,null,null,null,null,null,null,null,null,560,{"$f":"CJ15/SUM($CJ$14:$CJ$17)","v":0.18836192398250926},19]
{"$rows_left_out":98}
{"sheet":"MixDesign","index":1,"n_rows":62,"n_cols":10,"rows_kept":62,"cut":false,"hidden":false,"merged":[[1,3,2,9],[47,9,47,10],[45,9,45,10],[45,6,45,7],[45,2,45,5],[44,2,44,5],[44,6,44,7],[44,9,44,10],[46,9,46,10],[46,2,46,5],[46,6,46,7],[36,2,36,5],[33,2,33,5],[33,6,33,7],[33,9,33,10],[37,2,37,5],[50,7,50,8],[51,7,51,8],[52,7,52,8],[56,7,56,8],[53,7,53,8],[49,7,49,8],[41,2,41,5],[41,6,41,7],[41,9,41,10],[42,2,42,5],[42,6,42,7],[42,9,42,10],[43,9,43,10],[43,6,43,7],[43,2,43,5],[37,9,37,10],[34,2,34,5],[35,2,35,5],[34,6,34,7],[37,6,37,7],[36,9,36,10],[34,9,34,10],[35,9,35,10],[36,6,36,7],[35,6,35,7],[32,2,32,5],[32,6,32,7],[32,9,32,10],[31,2,31,5],[31,6,31,7],[31,9,31,10],[12,2,12,10],[13,2,13,10],[14,2,14,10],[17,2,17,10],[15,2,15,10],[16,2,16,10],[19,2,19,10],[28,2,28,5],[29,2,29,5],[30,2,30,5],[29,9,29,10],[30,9,30,10],[20,2,20,10],[28,9,28,10],[28,6,28,7],[29,6,29,7],[30,6,30,7],[38,2,38,5],[39,2,39,5],[39,9,39,10],[40,2,40,5],[40,6,40,7],[40,9,40,10],[39,6,39,7],[38,6,38,7],[38,9,38,10]]}
[]
[null,null,null,"KU MIX 3.4 BETA 1"]
[]
[]
[]
[]
[]
[]
[]
[]
[]
[]
[null,null,{"$f":"IF(ISBLANK(Calculations!B71)=TRUE,\"BLANK\",Calculations!B71)","v":"University of Kansas"}]
[null,null,{"$f":"IF(ISBLANK(Calculations!B72)=TRUE,\"BLANK\",Calculations!B72)","v":"CEAE Department"}]
[null,null,{"$f":"IF(ISBLANK(Calculations!B73)=TRUE,\"BLANK\",Calculations!B73)","v":"2150 Learned Hall"}]
{"$rows_left_out":48}
{"sheet":"Advanced","index":2,"n_rows":97,"n_cols":17,"rows_kept":97,"cut":false,"hidden":false,"merged":[[93,9,93,10],[59,5,59,9],[72,9,72,10],[73,4,73,5],[71,9,71,10],[60,5,60,9],[91,9,91,10],[92,9,92,10],[87,9,87,10],[67,9,67,10],[96,9,96,10],[68,9,68,10],[69,9,69,10],[66,9,66,10],[95,3,95,4],[96,3,96,4],[78,5,78,10],[93,3,93,4],[80,9,80,10],[81,9,81,10],[77,3,77,4],[94,9,94,10],[88,9,88,10],[89,9,89,10],[95,9,95,10],[90,9,90,10],[104,11,104,16],[39,9,39,10],[40,9,40,10],[41,9,41,10],[42,9,42,10],[43,9,43,10],[44,9,44,10],[45,9,45,10],[46,9,46,10],[62,11,62,16],[86,9,86,10],[82,9,82,10],[83,9,83,10],[84,9,84,10],[85,9,85,10],[79,9,79,10],[83,11,83,16],[76,14,76,16],[36,9,38,10],[47,9,47,10],[48,9,48,10],[49,9,49,10],[50,9,50,10],[70,9,70,10],[42,11,42,16],[51,9,51,10],[53,9,53,10],[54,9,54,10],[77,5,77,10],[32,4,32,5],[36,3,37,4],[37,5,37,6],[15,3,16,4],[15,5,16,13],[36,7,36,8],[21,4,22,15],[20,10,20,15],[27,9,27,10],[36,5,36,6],[28,9,28,10],[37,7,37,8],[1,3,2,15],[10,3,11,15],[35,14,35,16],[17,10,18,15],[17,3,18,9],[19,3,19,9],[20,3,20,9],[19,10,19,15],[12,3,13,4],[29,9,29,10],[31,9,31,10],[32,9,32,10],[33,9,33,10],[34,9,34,10],[30,9,30,10],[12,5,13,13]]}
[]
[null,null,null,"GRADATION DETAILS"]
[]
[]
[]
[]
[]
[]
[]
[]
[null,null,null,"1.  Select Minimum and Maximum Gradation Limits (if desired)"]
[]
[null,null,null,"a.",null,"Press the button at right to input the minimum and maximum gradation limits"]
[]
[]
{"$rows_left_out":83}
{"sheet":"Program v.3","index":3,"n_rows":168,"n_cols":37,"rows_kept":168,"cut":false,"hidden":false,"merged":[[76,4,76,5],[75,4,75,5],[72,2,73,3],[21,5,21,8],[22,5,22,8],[37,8,38,8],[45,7,46,7],[1,2,2,10],[19,5,19,8],[18,2,18,4],[19,2,19,4],[9,2,11,10],[17,5,17,8],[18,5,18,8],[17,2,17,4],[12,2,13,2],[15,2,16,2],[12,3,13,7],[15,3,16,7],[24,2,25,2],[24,3,25,7],[20,2,20,4],[21,2,21,4],[22,2,22,4],[77,2,77,3],[77,4,77,5],[51,5,51,6],[48,5,48,6],[49,5,49,6],[51,2,51,3],[63,2,64,3],[63,8,64,8],[72,10,73,10],[63,9,64,9],[72,9,73,9],[67,2,68,2],[67,3,68,7],[72,4,73,5],[72,6,72,7],[63,4,64,5],[70,2,71,2],[72,8,73,8],[50,2,50,3],[76,2,76,3],[65,2,65,3],[65,4,65,5],[74,4,74,5],[75,2,75,3],[248,3,248,4],[248,5,248,10],[246,5,247,10],[194,4,196,5],[194,6,196,6],[194,10,196,10],[194,9,196,9],[194,7,196,7],[220,10,220,12],[246,12,247,12],[246,13,247,13],[246,11,247,11],[223,10,223,12],[78,2,78,3],[219,10,219,12],[218,10,218,12],[78,4,78,5],[194,12,196,12],[194,11,196,11],[246,3,247,4],[221,10,221,12],[222,10,222,12],[82,2,84,10],[88,2,91,2],[88,3,91,7],[85,2,86,2],[85,3,86,7],[40,3,41,7],[34,2,35,2],[37,10,38,10],[31,2,33,10],[37,2,38,2],[40,2,41,2],[20,5,20,8],[37,3,38,5],[34,3,35,7],[70,3,71,7],[74,2,74,3],[43,2,44,2],[58,2,59,2],[58,3,59,7],[48,2,48,3],[63,6,63,7],[55,2,57,10],[27,2,28,2],[27,3,28,7],[43,3,44,8],[45,2,46,3],[45,4,46,4],[50,5,50,6],[47,2,47,3],[45,10,46,10],[63,10,64,10],[45,9,46,9],[45,5,46,6],[47,5,47,6],[61,2,62,2],[61,3,62,7],[49,2,49,3],[45,8,46,8]]}
[]
[null,null,"MIX DESIGN INPUT AND OPTIMIZATION"]
[]
[]
[]
[]
[]
[]
[]
[null,null,"1.  Select Cementious Materials, Water-Cementitious Material Ratio, and Design Air Content"]
[]
[]
[null,null,"a.","Press the button at right to Select Cementious Materials"]
[]
[]
{"$rows_left_out":154}
{"sheet":"Aggregates","index":4,"n_rows":200,"n_cols":21,"rows_kept":200,"cut":false,"hidden":false,"merged":[[4,10,5,10],[0,1,2,1],[3,1,5,1],[3,3,5,3],[3,2,5,2],[3,19,5,19],[3,4,3,16],[4,4,5,4],[4,5,5,5],[4,6,5,6],[4,7,5,7],[4,8,5,8],[4,9,5,9],[3,18,5,18],[4,16,5,16],[4,11,5,11],[4,12,5,12],[4,13,5,13],[4,15,5,15],[3,17,5,17],[4,14,5,14]]}
[null,"Aggregate Information"]
[]
[]
[null,"Name","Designation","Specific Gravity","Percent Retained On Each Sieve",null,null,null,null,null,null,null,null,null,null,null,null,"SIEVE CHECK","% Absorption","Supplier"]
[null,null,null,null,"1 1/2\"","1\"","3/4\"","1/2\"","3/8\"","#4","#8","#16","#30","#50","#100","#200","pan",null,null,null,"   Notes:"]
["Name -- Designation"]
[{"$f":"IF(ISBLANK(B7)=TRUE,\"\",IF(C7=\"\",B7,CONCATENATE(B7,\" -- \",C7)))","v":"3/4\" GMQ -- CA-5"},"3/4\" GMQ","CA-5",2.64,0,0,0,0.26,0.26,0.45,0.03,0,0,0,0,0,0,{"$f":"IF(SUM(E7:Q7)=0,\"\",SUM(E7:Q7))","v":1},7.0000000000000001E-3,"GMQ"]
[{"$f":"IF(ISBLANK(B8)=TRUE,\"\",IF(C8=\"\",B8,CONCATENATE(B8,\" -- \",C8)))","v":"1-1/2\" PCCP GMQ -- CA-6"},"1-1/2\" PCCP GMQ","CA-6",2.64,0,0.17,0.27,0.28000000000000003,0.13,0.15,0,0,0,0,0,0,0,{"$f":"IF(SUM(E8:Q8)=0,\"\",SUM(E8:Q8))","v":1},7.0000000000000001E-3,"GMQ"]
["Midwest Concrete Materials -- MA-2","Midwest Concrete Materials","MA-2",2.63,0,0,0,0,0,0.04,0.2,0.26,0.2,0.21,0.09,0,0,0.99999999999999989,1.6299999999999999E-2,"Holliday Sand"]
["",null,null,null,null,null,null,null,null,null,null,null,null,null,null,null,null,{"$f":"IF(SUM(E10:Q10)=0,\"\",SUM(E10:Q10))","v":""}]
["",null,null,null,null,null,null,null,null,null,null,null,null,null,null,null,null,""]
[{"$f":"IF(ISBLANK(B12)=TRUE,\"\",IF(C12=\"\",B12,CONCATENATE(B12,\" -- \",C12)))","v":""},null,null,null,null,null,null,null,null,null,null,null,null,null,null,null,null,""]
["",null,null,null,null,null,null,null,null,null,null,null,null,null,null,null,null,""]
["",null,null,null,null,null,null,null,null,null,null,null,null,null,null,null,null,""]
["",null,null,null,null,null,null,null,null,null,null,null,null,null,null,null,null,""]
{"$rows_left_out":186}
{"sheet":"Aggregates (Max-Min)","index":5,"n_rows":75,"n_cols":17,"rows_kept":75,"cut":false,"hidden":false,"merged":[[4,5,5,5],[4,6,5,6],[4,7,5,7],[0,1,2,4],[3,1,5,1],[3,2,5,2],[3,3,3,15],[4,3,5,3],[4,8,5,8],[4,9,5,9],[4,4,5,4],[4,15,5,15],[4,10,5,10],[4,11,5,11],[4,12,5,12],[4,13,5,13],[4,14,5,14]]}
[null,"Maximum and Minimum Combined Aggregate Gradation Constraints"]
[]
[]
[null,"Name","Designation                      (Minimum or Maximum)","Percent Retained on Individual Sieves"]
[null,null,null,"1 1/2\"","1\"","3/4\"","1/2\"","3/8\"","#4","#8","#16","#30","#50","#100","#200","pan","   Notes:"]
["Name -- Designation"]
[{"$f":"IF(ISBLANK(B7)=TRUE,\"\",IF(C7=\"\",B7,CONCATENATE(B7,\" -- \",C7)))","v":"8 - 18 Rule -- Min"},"8 - 18 Rule","Min",0.08,0.08,0.08,0.08,0.08,0.08,0.08,0.08,0.08,0.08,0.08,0.08,0.08]
[{"$f":"IF(ISBLANK(B8)=TRUE,\"\",IF(C8=\"\",B8,CONCATENATE(B8,\" -- \",C8)))","v":"8 - 18 Rule -- Max"},"8 - 18 Rule","Max",0.18,0.18,0.18,0.18,0.18,0.18,0.18,0.18,0.18,0.18,0.18,0.18,0.18]
[""]
["KDOT LC-HPC -- Min","KDOT LC-HPC","Min",0,0.02,0.05,0.08,0.08,0.08,0.08,0.08,0.08,0.05,0,0,0]
["KDOT LC-HPC -- Max","KDOT LC-HPC","Max",0,0.06,0.18,0.18,0.18,0.18,0.18,0.18,0.15,0.15,0.05,0.05,0.02]
[""]
[""]
[""]
[""]
{"$rows_left_out":61}
{"sheet":"AEA","index":6,"n_rows":75,"n_cols":10,"rows_kept":75,"cut":false,"hidden":false,"merged":[[3,9,5,9],[0,1,2,1],[3,4,3,5],[3,1,5,1],[3,6,5,6],[3,8,5,8],[4,4,4,5],[3,7,5,7],[3,2,5,2],[3,3,5,3]]}
[null,"Air Entraining Agents"]
[]
[]
[null,"Name","Percent Solids","Specific Gravity","Recommended Dosages",null,"Producer","Sample #","Date Obtained","Notes:"]
[null,null,null,null,"(oz per 100 lbs cement)"]
["Material -- Producer -- Sample #",null,null,null,"Minimum","Maximum"]
[{"$f":"IF(ISBLANK(B7)=TRUE,\"\",CONCATENATE(B7, \" -- \", G7, \" -- \", \"# \", H7))","v":"Air Entraining Agent -- Air R Us -- # 1"},"Air Entraining Agent",0.3,1.01,0.125,1.6,"Air R Us",1,"2008-12-23"]
[{"$f":"IF(ISBLANK(B8)=TRUE,\"\",CONCATENATE(B8, \" -- \", G8, \" -- \", \"# \", H8))","v":""}]
[""]
[""]
[""]
[""]
[""]
[""]
[""]
{"$rows_left_out":61}
{"sheet":"Admixtures","index":7,"n_rows":75,"n_cols":10,"rows_kept":75,"cut":false,"hidden":false,"merged":[[3,9,5,9],[0,1,2,1],[3,4,3,5],[3,1,5,1],[3,6,5,6],[3,8,5,8],[4,4,4,5],[3,2,5,2],[3,3,5,3],[3,7,5,7]]}
[null,"Other Admixtures"]
[]
[]
[null,"Name","Percent Solids","Specific Gravity","Recommended Dosages",null,"Producer","Sample #","Date Obtained","Notes:"]
[null,null,null,null,"(oz per 100 lbs cm)"]
["Material -- Producer -- Sample #",null,null,null,"Minimum","Maximum"]
[{"$f":"IF(ISBLANK(B7)=TRUE,\"\",CONCATENATE(B7, \" -- \", G7, \" -- \", \"# \", H7))","v":"Superplasticizer -- Admixtures R Us -- # 1"},"Superplasticizer",0.3,1.2,4.5,13.5,"Admixtures R Us",1,"2008-12-25"]
[{"$f":"IF(ISBLANK(B8)=TRUE,\"\",CONCATENATE(B8, \" -- \", G8, \" -- \", \"# \", H8))","v":""}]
[""]
[""]
[""]
[""]
[""]
[""]
[""]
{"$rows_left_out":61}
{"sheet":"Cement","index":8,"n_rows":75,"n_cols":7,"rows_kept":75,"cut":false,"hidden":false,"merged":[[0,1,2,2],[3,3,5,3],[3,6,5,6],[3,1,5,1],[3,2,5,2],[3,5,5,5],[3,4,5,4]]}
[null,"Cementitious Materials"]
[]
[]
[null,"Material","Producer","Sample #","Specific Gravity","Date Obtained","Notes:"]
[]
["Material -- Producer -- Sample #"]
[{"$f":"IF(ISBLANK(B7)=TRUE,\"\",CONCATENATE(B7, \" -- \", C7, \" -- \", \"# \", D7))","v":"Type I/II Cement -- Cement Producer -- # 1"},"Type I/II Cement","Cement Producer",1,3.2,"2008-12-23"]
[{"$f":"IF(ISBLANK(B8)=TRUE,\"\",CONCATENATE(B8, \" -- \", C8, \" -- \", \"# \", D8))","v":""}]
[""]
[""]
[""]
[""]
[""]
[""]
[""]
{"$rows_left_out":61}
{"sheet":"Calculations","index":9,"n_rows":134,"n_cols":43,"rows_kept":134,"cut":false,"hidden":false,"merged":[[65,33,66,34],[65,31,66,32],[0,9,0,10],[113,24,113,25]]}
["Cements Selected",null,null,null,null,null,null,null,null,"Error Check",null,null,"Cement Name"]
[null,"Cement Type","Producer","Sample #","Specific Gravity","Date Obtained","Producer -- Sample","Quantity","# of C.M.","Column",null,"LEFT(22)","LEFT(22)"]
["Type I/II Cement -- Cement Producer -- # 1",{"$f":"IF(IF($A3=\"\",\"\",VLOOKUP($A3,Cement!$A$7:$G$75,2,FALSE))=0,\"\",IF($A3=\"\",\"\",VLOOKUP($A3,Cement!$A$7:$G$75,2,FALSE)))","v":"Type I/II Cement"},{"$f":"IF(IF($A3=\"\",\"\",VLOOKUP($A3,Cement!$A$7:$G$75,3,FALSE))=0,\"\",IF($A3=\"\",\"\",VLOOKUP($A3,Cement!$A$7:$G$75,3,FALSE)))","v":"Cement Producer"},{"$f":"IF(IF($A3=\"\",\"\",VLOOKUP($A3,Cement!$A$7:$G$75,4,FALSE))=0,\"\",IF($A3=\"\",\"\",VLOOKUP($A3,Cement!$A$7:$G$75,4,FALSE)))","v":1},{"$f":"IF(IF($A3=\"\",\"\",VLOOKUP($A3,Cement!$A$7:$G$75,5,FALSE))=0,\"\",IF($A3=\"\",\"\",VLOOKUP($A3,Cement!$A$7:$G$75,5,FALSE)))","v":3.2},{"$f":"IF(IF($A3=\"\",\"\",VLOOKUP($A3,Cement!$A$7:$G$75,6,FALSE))=0,\"\",IF($A3=\"\",\"\",VLOOKUP($A3,Cement!$A$7:$G$75,6,FALSE)))","v":"2008-12-23"},{"$f":"IF(D3=\"\",C3,CONCATENATE(C3,\"-- #\",D3))","v":"Cement Producer-- #1"},{"$f":"'Program v.3'!K19","v":535},{"$f":"COUNTA(cementc)","v":1},"B",{"$f":"IF(OR(ISERROR($B$3)=TRUE, ISERROR($B$4)=TRUE,ISERROR($B$5)=TRUE,ISERROR($B$6)=TRUE, ISERROR($B$7)=TRUE)=TRUE,\"Error\",\"none\")","v":"none"},{"$f":"LEFT(C3,22)","v":"Cement Producer"},{"$f":"LEFT(B3,22)","v":"Type I/II Cement"}]
[null,{"$f":"IF(IF($A4=\"\",\"\",VLOOKUP($A4,Cement!$A$7:$G$75,2,FALSE))=0,\"\",IF($A4=\"\",\"\",VLOOKUP($A4,Cement!$A$7:$G$75,2,FALSE)))","v":""},{"$f":"IF(IF($A4=\"\",\"\",VLOOKUP($A4,Cement!$A$7:$G$75,3,FALSE))=0,\"\",IF($A4=\"\",\"\",VLOOKUP($A4,Cement!$A$7:$G$75,3,FALSE)))","v":""},{"$f":"IF(IF($A4=\"\",\"\",VLOOKUP($A4,Cement!$A$7:$G$75,4,FALSE))=0,\"\",IF($A4=\"\",\"\",VLOOKUP($A4,Cement!$A$7:$G$75,4,FALSE)))","v":""},{"$f":"IF(IF($A4=\"\",\"\",VLOOKUP($A4,Cement!$A$7:$G$75,5,FALSE))=0,\"\",IF($A4=\"\",\"\",VLOOKUP($A4,Cement!$A$7:$G$75,5,FALSE)))","v":""},{"$f":"IF(IF($A4=\"\",\"\",VLOOKUP($A4,Cement!$A$7:$G$75,6,FALSE))=0,\"\",IF($A4=\"\",\"\",VLOOKUP($A4,Cement!$A$7:$G$75,6,FALSE)))","v":""},{"$f":"IF(D4=\"\",C4,CONCATENATE(C4,\"-- #\",D4))","v":""},{"$f":"'Program v.3'!K20","v":0},null,"C",{"$f":"IF(OR(ISERROR($C$3)=TRUE, ISERROR($C$4)=TRUE,ISERROR($C$5)=TRUE,ISERROR($C$6)=TRUE, ISERROR($C$7)=TRUE)=TRUE,\"Error\",\"none\")","v":"none"},{"$f":"LEFT(C4,22)","v":""},{"$f":"LEFT(B4,22)","v":""}]
[null,{"$f":"IF(IF($A5=\"\",\"\",VLOOKUP($A5,Cement!$A$7:$G$75,2,FALSE))=0,\"\",IF($A5=\"\",\"\",VLOOKUP($A5,Cement!$A$7:$G$75,2,FALSE)))","v":""},{"$f":"IF(IF($A5=\"\",\"\",VLOOKUP($A5,Cement!$A$7:$G$75,3,FALSE))=0,\"\",IF($A5=\"\",\"\",VLOOKUP($A5,Cement!$A$7:$G$75,3,FALSE)))","v":""},{"$f":"IF(IF($A5=\"\",\"\",VLOOKUP($A5,Cement!$A$7:$G$75,4,FALSE))=0,\"\",IF($A5=\"\",\"\",VLOOKUP($A5,Cement!$A$7:$G$75,4,FALSE)))","v":""},{"$f":"IF(IF($A5=\"\",\"\",VLOOKUP($A5,Cement!$A$7:$G$75,5,FALSE))=0,\"\",IF($A5=\"\",\"\",VLOOKUP($A5,Cement!$A$7:$G$75,5,FALSE)))","v":""},{"$f":"IF(IF($A5=\"\",\"\",VLOOKUP($A5,Cement!$A$7:$G$75,6,FALSE))=0,\"\",IF($A5=\"\",\"\",VLOOKUP($A5,Cement!$A$7:$G$75,6,FALSE)))","v":""},{"$f":"IF(D5=\"\",C5,CONCATENATE(C5,\"-- #\",D5))","v":""},{"$f":"'Program v.3'!K21","v":0},null,"D",{"$f":"IF(OR(ISERROR($D$3)=TRUE, ISERROR($D$4)=TRUE,ISERROR($D$5)=TRUE,ISERROR($D$6)=TRUE, ISERROR($D$7)=TRUE)=TRUE,\"Error\",\"none\")","v":"none"},{"$f":"LEFT(C5,22)","v":""},{"$f":"LEFT(B5,22)","v":""}]
[null,{"$f":"IF(IF($A6=\"\",\"\",VLOOKUP($A6,Cement!$A$7:$G$75,2,FALSE))=0,\"\",IF($A6=\"\",\"\",VLOOKUP($A6,Cement!$A$7:$G$75,2,FALSE)))","v":""},{"$f":"IF(IF($A6=\"\",\"\",VLOOKUP($A6,Cement!$A$7:$G$75,3,FALSE))=0,\"\",IF($A6=\"\",\"\",VLOOKUP($A6,Cement!$A$7:$G$75,3,FALSE)))","v":""},{"$f":"IF(IF($A6=\"\",\"\",VLOOKUP($A6,Cement!$A$7:$G$75,4,FALSE))=0,\"\",IF($A6=\"\",\"\",VLOOKUP($A6,Cement!$A$7:$G$75,4,FALSE)))","v":""},{"$f":"IF(IF($A6=\"\",\"\",VLOOKUP($A6,Cement!$A$7:$G$75,5,FALSE))=0,\"\",IF($A6=\"\",\"\",VLOOKUP($A6,Cement!$A$7:$G$75,5,FALSE)))","v":""},{"$f":"IF(IF($A6=\"\",\"\",VLOOKUP($A6,Cement!$A$7:$G$75,6,FALSE))=0,\"\",IF($A6=\"\",\"\",VLOOKUP($A6,Cement!$A$7:$G$75,6,FALSE)))","v":""},{"$f":"IF(D6=\"\",C6,CONCATENATE(C6,\"-- #\",D6))","v":""},{"$f":"'Program v.3'!K22","v":0},null,"E",{"$f":"IF(OR(ISERROR($E$3)=TRUE, ISERROR($E$4)=TRUE,ISERROR($E$5)=TRUE,ISERROR($E$6)=TRUE, ISERROR($E$7)=TRUE)=TRUE,\"Error\",\"none\")","v":"none"},{"$f":"LEFT(C6,22)","v":""},{"$f":"LEFT(B6,22)","v":""}]
[null,{"$f":"IF(IF($A7=\"\",\"\",VLOOKUP($A7,Cement!$A$7:$G$75,2,FALSE))=0,\"\",IF($A7=\"\",\"\",VLOOKUP($A7,Cement!$A$7:$G$75,2,FALSE)))","v":""},{"$f":"IF(IF($A7=\"\",\"\",VLOOKUP($A7,Cement!$A$7:$G$75,3,FALSE))=0,\"\",IF($A7=\"\",\"\",VLOOKUP($A7,Cement!$A$7:$G$75,3,FALSE)))","v":""},{"$f":"IF(IF($A7=\"\",\"\",VLOOKUP($A7,Cement!$A$7:$G$75,4,FALSE))=0,\"\",IF($A7=\"\",\"\",VLOOKUP($A7,Cement!$A$7:$G$75,4,FALSE)))","v":""},{"$f":"IF(IF($A7=\"\",\"\",VLOOKUP($A7,Cement!$A$7:$G$75,5,FALSE))=0,\"\",IF($A7=\"\",\"\",VLOOKUP($A7,Cement!$A$7:$G$75,5,FALSE)))","v":""},{"$f":"IF(IF($A7=\"\",\"\",VLOOKUP($A7,Cement!$A$7:$G$75,6,FALSE))=0,\"\",IF($A7=\"\",\"\",VLOOKUP($A7,Cement!$A$7:$G$75,6,FALSE)))","v":""},{"$f":"IF(D7=\"\",C7,CONCATENATE(C7,\"-- #\",D7))","v":""},{"$f":"'Program v.3'!K23","v":0},null,"F",{"$f":"IF(OR(ISERROR($F$3)=TRUE, ISERROR($F$4)=TRUE,ISERROR($F$5)=TRUE,ISERROR($F$6)=TRUE, ISERROR($F$7)=TRUE)=TRUE,\"Error\",\"none\")","v":"none"},{"$f":"LEFT(C7,22)","v":""},{"$f":"LEFT(B7,22)","v":""}]
[null,null,null,null,null,null,null,{"$f":"SUM(H3:H7)","v":535},null,null,{"$f":"IF(OR(K3=\"Error\",K4=\"Error\",K5=\"Error\",K6=\"Error\",K7=\"Error\"), 1,0)","v":0}]
[]
[]
["Air Entraining Agents","Name","Minimum","Maximum","Producer","Sample #","Date Obtained","min/max","Quantity","% Solids","S.G.","# of AEA","Error Check","Name","Producer"]
["Air Entraining Agent -- Air R Us -- # 1",{"$f":"IF(IF($A12=\"\",\"\",VLOOKUP($A12,AEA!$A$7:$I$75,2,FALSE))=0,\"\",IF($A12=\"\",\"\",VLOOKUP($A12,AEA!$A$7:$I$75,2,FALSE)))","v":"Air Entraining Agent"},{"$f":"IF(IF($A12=\"\",\"\",VLOOKUP($A12,AEA!$A$7:$I$75,5,FALSE))=0,\"\",IF($A12=\"\",\"\",VLOOKUP($A12,AEA!$A$7:$I$75,5,FALSE)))","v":0.125},{"$f":"IF(IF($A12=\"\",\"\",VLOOKUP($A12,AEA!$A$7:$I$75,6,FALSE))=0,\"\",IF($A12=\"\",\"\",VLOOKUP($A12,AEA!$A$7:$I$75,6,FALSE)))","v":1.6},{"$f":"IF(IF($A12=\"\",\"\",VLOOKUP($A12,AEA!$A$7:$I$75,7,FALSE))=0,\"\",IF($A12=\"\",\"\",VLOOKUP($A12,AEA!$A$7:$I$75,7,FALSE)))","v":"Air R Us"},{"$f":"IF(IF($A12=\"\",\"\",VLOOKUP($A12,AEA!$A$7:$I$75,8,FALSE))=0,\"\",IF($A12=\"\",\"\",VLOOKUP($A12,AEA!$A$7:$I$75,8,FALSE)))","v":1},{"$f":"IF(IF($A12=\"\",\"\",VLOOKUP($A12,AEA!$A$7:$I$75,9,FALSE))=0,\"\",IF($A12=\"\",\"\",VLOOKUP($A12,AEA!$A$7:$I$75,9,FALSE)))","v":39805},{"$f":"IF(A12=\"\",\"\",CONCATENATE(C12,\" / \",D12))","v":"0.125 / 1.6"},{"$f":"AEAQ","v":4},{"$f":"IF(A12=\"\",\"\",IF(VLOOKUP($A12,AEA!$A$7:$I$75,3,FALSE)=\"\",\"0\",VLOOKUP($A12,AEA!$A$7:$I$75,3,FALSE)))","v":0.3},{"$f":"IF(IF($A12=\"\",\"\",VLOOKUP($A12,AEA!$A$7:$I$75,4,FALSE))=0,\"\",IF($A12=\"\",\"\",VLOOKUP($A12,AEA!$A$7:$I$75,4,FALSE)))","v":1.01},{"$f":"COUNTA(A12)","v":1},{"$f":"IF(OR(ISERROR($B$12)=TRUE, ISERROR($E$12)=TRUE,ISERROR($C$12)=TRUE,ISERROR($F$12)=TRUE, ISERROR($D$12)=TRUE)=TRUE,\"Error\",\"none\")","v":"none"},"LEFT(25)","LEFT(25)"]
[null,null,null,null,null,null,null,null,null,null,null,null,{"$f":"IF(M12=\"Error\",1,0)","v":0},{"$f":"LEFT(B12,25)","v":"Air Entraining Agent"},{"$f":"LEFT(E12,25)","v":"Air R Us"}]
[]
[null,null,null,null,null,null,null,null,null,null,null,null,null,null,null,"Name","Producer"]
{"$rows_left_out":119}